Reaction Details
TargetBeta-2 adrenergic receptor
LigandBDBM50218170
Substrate/Competitorn/a
Meas. Tech.ChEMBL_457029 (CHEMBL924393)
Ki 30±n/a nM
Citation Lafontaine, JADay, RFDibrino, JHadcock, JRHargrove, DMLinhares, MMartin, KAMaurer, TSNardone, NATess, DADasilva-Jardine, P Discovery of potent and orally bioavailable heterocycle-based beta3-adrenergic receptor agonists, potential therapeutics for the treatment of obesity. Bioorg Med Chem Lett17:5245-50 (2007) 
 
Beta-2 adrenergic receptor
Name:Beta-2 adrenergic receptor
Type:n/a
Mol. Mass.:46461.69
Organism:Homo sapiens (Human)
Description:P07550
Residue:413
BDBM50218170
NameBDBM50218170
Synonyms:(R)-2-(2-(4-(2-(hydroxymethyl)oxazol-4-yl)phenoxy)ethylamino)-1-(pyridin-3-yl)ethanol | CHEMBL251180
TypeSmall organic molecule
Emp. Form.C19H21N3O4
Mol. Mass.355.3877
SMILESOCc1nc(co1)-c1ccc(OCCNC[C@H](O)c2cccnc2)cc1