Reaction Details
TargetBeta-1 adrenergic receptor
LigandBDBM50218177
Substrate/Competitorn/a
Meas. Tech.ChEMBL_457030 (CHEMBL924394)
Ki 50±n/a nM
Citation Lafontaine, JADay, RFDibrino, JHadcock, JRHargrove, DMLinhares, MMartin, KAMaurer, TSNardone, NATess, DADasilva-Jardine, P Discovery of potent and orally bioavailable heterocycle-based beta3-adrenergic receptor agonists, potential therapeutics for the treatment of obesity. Bioorg Med Chem Lett17:5245-50 (2007) 
 
Beta-1 adrenergic receptor
Name:Beta-1 adrenergic receptor
Type:G Protein-Coupled Receptor (GPCR)
Mol. Mass.:51338.40
Organism:Homo sapiens (Human)
Description:P08588
Residue:477
BDBM50218177
NameBDBM50218177
Synonyms:(R)-2-(2-(4-(2-(benzyloxymethyl)oxazol-4-yl)phenoxy)ethylamino)-1-(pyridin-3-yl)ethanol | CHEMBL250760
TypeSmall organic molecule
Emp. Form.C26H27N3O4
Mol. Mass.445.5103
SMILESO[C@@H](CNCCOc1ccc(cc1)-c1coc(COCc2ccccc2)n1)c1cccnc1