Reaction Details
TargetSubstance-P receptor
LigandBDBM50218240
Substrate/Competitorn/a
Meas. Tech.ChEMBL_457052 (CHEMBL923388)
IC50 0.07±n/a nM
Citation Lin, PChang, LDevita, RJYoung, JREid, RTong, XZheng, SBall, RGTsou, NNChicchi, GGKurtz, MMTsao, KLWheeldon, ACarlson, EJEng, WBurns, HDHargreaves, RJMills, SG The discovery of potent, selective, and orally bioavailable hNK1 antagonists derived from pyrrolidine. Bioorg Med Chem Lett17:5191-8 (2007) 
 
Substance-P receptor
Name:Substance-P receptor
Type:G Protein-Coupled Receptor (GPCR)
Mol. Mass.:46254.43
Organism:Homo sapiens (Human)
Description:P25103
Residue:407
BDBM50218240
NameBDBM50218240
Synonyms:3-((3S,4R)-3-((R)-1-(3,5-bis(trifluoromethyl)phenyl)ethoxy)-4-phenylpyrrolidin-1-yl)cyclopent-2-enone | CHEMBL399668
TypeSmall organic molecule
Emp. Form.C25H23F6NO2
Mol. Mass.483.446
SMILESC[C@@H](O[C@@H]1CN(C[C@H]1c1ccccc1)C1=CC(=O)CC1)c1cc(cc(c1)C(F)(F)F)C(F)(F)F