Reaction Details
TargetRetinoic acid receptor RXR-alpha
LigandBDBM50218430
Substrate/Competitorn/a
Meas. Tech.ChEMBL_440654 (CHEMBL889748)
IC50 2000±n/a nM
Citation Sakaki, JKishida, MKonishi, KGunji, HToyao, AMatsumoto, YKanazawa, TUchiyama, HFukaya, HMitani, HArai, YKimura, M Synthesis and structure-activity relationship of novel RXR antagonists: orally active anti-diabetic and anti-obesity agents. Bioorg Med Chem Lett17:4804-7 (2007) 
 
Retinoic acid receptor RXR-alpha
Name:Retinoic acid receptor RXR-alpha
Type:PROTEIN
Mol. Mass.:50820.38
Organism:Homo sapiens (Human)
Description:ChEMBL_1456363
Residue:462
BDBM50218430
NameBDBM50218430
Synonyms:4-(5,7,7,10,10-pentamethyl-2-methylsulfanyl-7,8,9,10-tetrahydro-5H-5,13-diaza-benzo[4,5]cyclohepta[1,2-b]naphthalen-12-yl)-benzoic acid | CHEMBL244801
TypeSmall organic molecule
Emp. Form.C30H32N2O2S
Mol. Mass.484.652
SMILESCSc1ccc2N(C)c3cc4c(cc3C(=Nc2c1)c1ccc(cc1)C(O)=O)C(C)(C)CCC4(C)C