Reaction Details
TargetRetinoic acid receptor RXR-alpha
LigandBDBM50218442
Substrate/Competitorn/a
Meas. Tech.ChEMBL_440653 (CHEMBL889747)
IC50 970±n/a nM
Citation Sakaki, JKishida, MKonishi, KGunji, HToyao, AMatsumoto, YKanazawa, TUchiyama, HFukaya, HMitani, HArai, YKimura, M Synthesis and structure-activity relationship of novel RXR antagonists: orally active anti-diabetic and anti-obesity agents. Bioorg Med Chem Lett17:4804-7 (2007) 
 
Retinoic acid receptor RXR-alpha
Name:Retinoic acid receptor RXR-alpha
Type:PROTEIN
Mol. Mass.:50820.38
Organism:Homo sapiens (Human)
Description:ChEMBL_1456363
Residue:462
BDBM50218442
NameBDBM50218442
Synonyms:4-(2-acetyl-5-ethyl-7,7,10,10-tetramethyl-7,8,9,10-tetrahydro-5H-5,13-diaza-benzo[4,5]cyclohepta[1,2-b]naphthalen-12-yl)-benzoic acid | CHEMBL394622
TypeSmall organic molecule
Emp. Form.C32H34N2O3
Mol. Mass.494.624
SMILESCCN1c2ccc(cc2N=C(c2ccc(cc2)C(O)=O)c2cc3c(cc12)C(C)(C)CCC3(C)C)C(C)=O