Reaction Details
TargetRetinoic acid receptor RXR-alpha
LigandBDBM50218432
Substrate/Competitorn/a
Meas. Tech.ChEMBL_440654 (CHEMBL889748)
IC50 520±n/a nM
Citation Sakaki, JKishida, MKonishi, KGunji, HToyao, AMatsumoto, YKanazawa, TUchiyama, HFukaya, HMitani, HArai, YKimura, M Synthesis and structure-activity relationship of novel RXR antagonists: orally active anti-diabetic and anti-obesity agents. Bioorg Med Chem Lett17:4804-7 (2007) 
 
Retinoic acid receptor RXR-alpha
Name:Retinoic acid receptor RXR-alpha
Type:PROTEIN
Mol. Mass.:50820.38
Organism:Homo sapiens (Human)
Description:ChEMBL_1456363
Residue:462
BDBM50218432
NameBDBM50218432
Synonyms:4-(2-cyano-5,7,7,10,10-pentamethyl-7,8,9,10-tetrahydro-5H-5,13-diaza-benzo[4,5]cyclohepta[1,2-b]naphthalen-12-yl)-2-fluoro-benzoic acid | CHEMBL396200
TypeSmall organic molecule
Emp. Form.C30H28FN3O2
Mol. Mass.481.5606
SMILESCN1c2ccc(cc2N=C(c2ccc(C(O)=O)c(F)c2)c2cc3c(cc12)C(C)(C)CCC3(C)C)C#N