Reaction Details
TargetRetinoic acid receptor RXR-alpha
LigandBDBM50218425
Substrate/Competitorn/a
Meas. Tech.ChEMBL_440654 (CHEMBL889748)
IC50 780±n/a nM
Citation Sakaki, JKishida, MKonishi, KGunji, HToyao, AMatsumoto, YKanazawa, TUchiyama, HFukaya, HMitani, HArai, YKimura, M Synthesis and structure-activity relationship of novel RXR antagonists: orally active anti-diabetic and anti-obesity agents. Bioorg Med Chem Lett17:4804-7 (2007) 
 
Retinoic acid receptor RXR-alpha
Name:Retinoic acid receptor RXR-alpha
Type:PROTEIN
Mol. Mass.:50820.38
Organism:Homo sapiens (Human)
Description:ChEMBL_1456363
Residue:462
BDBM50218425
NameBDBM50218425
Synonyms:4-[2-(4-methoxy-phenylmethanesulfonyl)-5,7,7,10,10-pentamethyl-7,8,9,10-tetrahydro-5H-5,13-diaza-benzo[4,5]cyclohepta[1,2-b]naphthalen-12-yl]-benzoic acid | CHEMBL436628
TypeSmall organic molecule
Emp. Form.C37H38N2O5S
Mol. Mass.622.773
SMILESCOc1ccc(CS(=O)(=O)c2ccc3N(C)c4cc5c(cc4C(=Nc3c2)c2ccc(cc2)C(O)=O)C(C)(C)CCC5(C)C)cc1