Reaction Details
TargetCholinesterase
LigandBDBM50218506
Substrate/Competitorn/a
Meas. Tech.ChEMBL_444936 (CHEMBL894086)
IC50>0.000±n/a nM
Commentsmodified from >0.000010
Citation Piazzi, LCavalli, ABelluti, FBisi, AGobbi, SRizzo, SBartolini, MAndrisano, VRecanatini, MRampa, A Extensive SAR and computational studies of 3-{4-[(benzylmethylamino)methyl]phenyl}-6,7-dimethoxy-2H-2-chromenone (AP2238) derivatives. J Med Chem50:4250-4 (2007) 
 
Cholinesterase
Name:Cholinesterase
Type:Homotetramer
Mol. Mass.:68422.27
Organism:Homo sapiens (Human)
Description:P06276
Residue:602
BDBM50218506
NameBDBM50218506
Synonyms:3-{4-[(benzylmethylamino)methyl]phenyl}-6,7-dimethoxychromen-4-one | CHEMBL244838
TypeSmall organic molecule
Emp. Form.C26H25NO4
Mol. Mass.415.481
SMILESCOc1cc2occ(-c3ccc(CN(C)Cc4ccccc4)cc3)c(=O)c2cc1OC