Reaction Details
TargetCholinesterase
LigandBDBM50218511
Substrate/Competitorn/a
Meas. Tech.ChEMBL_444936 (CHEMBL894086)
IC50>0.000±n/a nM
Commentsmodified from >0.000010
Citation Piazzi, LCavalli, ABelluti, FBisi, AGobbi, SRizzo, SBartolini, MAndrisano, VRecanatini, MRampa, A Extensive SAR and computational studies of 3-{4-[(benzylmethylamino)methyl]phenyl}-6,7-dimethoxy-2H-2-chromenone (AP2238) derivatives. J Med Chem50:4250-4 (2007) 
 
Cholinesterase
Name:Cholinesterase
Type:Homotetramer
Mol. Mass.:68422.27
Organism:Homo sapiens (Human)
Description:P06276
Residue:602
BDBM50218511
NameBDBM50218511
Synonyms:6,7-dimethoxy-3-(4-{[(4-nitrobenzyl)methylamino]methyl}phenyl)-chromen-2-one | CHEMBL242906
TypeSmall organic molecule
Emp. Form.C26H24N2O6
Mol. Mass.460.4786
SMILESCOc1cc2cc(-c3ccc(CN(C)Cc4ccc(cc4)[N+]([O-])=O)cc3)c(=O)oc2cc1OC