Reaction Details
TargetAcetylcholinesterase
LigandBDBM50218523
Substrate/Competitorn/a
Meas. Tech.ChEMBL_444935 (CHEMBL894085)
IC50 3100±n/a nM
Citation Piazzi, LCavalli, ABelluti, FBisi, AGobbi, SRizzo, SBartolini, MAndrisano, VRecanatini, MRampa, A Extensive SAR and computational studies of 3-{4-[(benzylmethylamino)methyl]phenyl}-6,7-dimethoxy-2H-2-chromenone (AP2238) derivatives. J Med Chem50:4250-4 (2007) 
 
Acetylcholinesterase
Name:Acetylcholinesterase
Type:Enzyme
Mol. Mass.:67792.70
Organism:Homo sapiens (Human)
Description:P22303
Residue:614
BDBM50218523
NameBDBM50218523
Synonyms:2-{4-[(benzylmethylamino)methyl]phenyl}-6,7-dimethoxychromen-4-one | CHEMBL241827
TypeSmall organic molecule
Emp. Form.C26H25NO4
Mol. Mass.415.481
SMILESCOc1cc2oc(cc(=O)c2cc1OC)-c1ccc(CN(C)Cc2ccccc2)cc1