Reaction Details
TargetCannabinoid receptor 1
LigandBDBM50219071
Substrate/Competitorn/a
Meas. Tech.ChEMBL_445329 (CHEMBL894469)
Ki 2.7±n/a nM
Citation Papahatjis, DPNahmias, VRNikas, SPAndreou, TAlapafuja, SOTsotinis, AGuo, JFan, PMakriyannis, A C1'-cycloalkyl side chain pharmacophore in tetrahydrocannabinols. J Med Chem50:4048-60 (2007) 
 
Cannabinoid receptor 1
Name:Cannabinoid receptor 1
Type:G Protein-Coupled Receptor (GPCR)
Mol. Mass.:52856.55
Organism:Rattus norvegicus (rat)
Description:P20272
Residue:473
BDBM50219071
NameBDBM50219071
Synonyms:(6aR-trans)-3-(1-heptylcyclobutyl)-6a,7,10,10a-tetrahydro-6,6,9-trimethyl-6H-dibenzo[b,d]pyran-1-ol | CHEMBL390404
TypeSmall organic molecule
Emp. Form.C27H40O2
Mol. Mass.396.6053
SMILESCCCCCCCC1(CCC1)c1cc(O)c2[C@@H]3CC(C)=CC[C@H]3C(C)(C)Oc2c1