Reaction Details
TargetAmyloid-beta precursor protein
LigandBDBM50220302
Substrate/Competitorn/a
Meas. Tech.ChEMBL_449193 (CHEMBL899458)
IC50 3.5±n/a nM
Citation Josien, HBara, TRajagopalan, MAsberom, TClader, JWFavreau, LGreenlee, WJHyde, LANomeir, AAParker, EMPissarnitski, DASong, LWong, GTZhang, LZhang, QZhao, Z Small conformationally restricted piperidine N-arylsulfonamides as orally active gamma-secretase inhibitors. Bioorg Med Chem Lett17:5330-5 (2007) 
 
Amyloid-beta precursor protein
Name:Amyloid-beta precursor protein
Type:Single-pass type I membrane protein
Mol. Mass.:86890.41
Organism:Homo sapiens (Human)
Description:P05067
Residue:770
BDBM50220302
NameBDBM50220302
Synonyms:1-((2R,6S)-1-(4-chlorophenylsulfonyl)-6-(2,2,2-trifluoroethyl)piperidin-2-yl)cyclopropyl 4-(piperidin-1-yl)piperidine-1-carboxylate | CHEMBL442801
TypeSmall organic molecule
Emp. Form.C27H37ClF3N3O4S
Mol. Mass.592.114
SMILESFC(F)(F)C[C@@H]1CCC[C@@H](N1S(=O)(=O)c1ccc(Cl)cc1)C1(CC1)OC(=O)N1CCC(CC1)N1CCCCC1