Reaction Details
TargetBeta-secretase 1
LigandBDBM50220317
Substrate/Competitorn/a
Meas. Tech.ChEMBL_449199 (CHEMBL899464)
IC50 8300±n/a nM
Citation Fobare, WFSolvibile, WRRobichaud, AJMalamas, MSManas, ETurner, JHu, YWagner, EChopra, RCowling, RJin, GBard, J Thiophene substituted acylguanidines as BACE1 inhibitors. Bioorg Med Chem Lett17:5353-6 (2007) 
 
Beta-secretase 1
Name:Beta-secretase 1
Type:Protein
Mol. Mass.:55755.10
Organism:Homo sapiens (Human)
Description:P56817
Residue:501
BDBM50220317
NameBDBM50220317
Synonyms:CHEMBL236850 | N-(diaminomethylene)-2-(2,4-diphenylthiophen-3-yl)acetamide
TypeSmall organic molecule
Emp. Form.C19H17N3OS
Mol. Mass.335.423
SMILESNC(=N)NC(=O)Cc1c(csc1-c1ccccc1)-c1ccccc1