Reaction Details
TargetBeta-secretase 1
LigandBDBM16751
Substrate/Competitorn/a
Meas. Tech.ChEMBL_449199 (CHEMBL899464)
IC50 3700±n/a nM
Citation Fobare, WFSolvibile, WRRobichaud, AJMalamas, MSManas, ETurner, JHu, YWagner, EChopra, RCowling, RJin, GBard, J Thiophene substituted acylguanidines as BACE1 inhibitors. Bioorg Med Chem Lett17:5353-6 (2007) 
 
Beta-secretase 1
Name:Beta-secretase 1
Type:Protein
Mol. Mass.:55755.10
Organism:Homo sapiens (Human)
Description:P56817
Residue:501
BDBM16751
NameBDBM16751
Synonyms:(N-(diaminomethylene)-2,4-diphenyl-1H-pyrrole-1-acetamide) CHEMBL217068 | N-(diaminomethylidene)-2-(2,5-diphenyl-1H-pyrrol-1-yl)acetamide
TypeSmall organic molecule
Emp. Form.C19H18N4O
Mol. Mass.318.3724
SMILESNC(=N)NC(=O)Cn1c(ccc1-c1ccccc1)-c1ccccc1