Reaction Details
TargetBeta-secretase 1
LigandBDBM50220312
Substrate/Competitorn/a
Meas. Tech.ChEMBL_449199 (CHEMBL899464)
IC50 630±n/a nM
Citation Fobare, WFSolvibile, WRRobichaud, AJMalamas, MSManas, ETurner, JHu, YWagner, EChopra, RCowling, RJin, GBard, J Thiophene substituted acylguanidines as BACE1 inhibitors. Bioorg Med Chem Lett17:5353-6 (2007) 
 
Beta-secretase 1
Name:Beta-secretase 1
Type:Protein
Mol. Mass.:55755.10
Organism:Homo sapiens (Human)
Description:P56817
Residue:501
BDBM50220312
NameBDBM50220312
Synonyms:2-(4-(2-chlorophenyl)-2-(4-propoxyphenyl)thiophen-3-yl)-N-(diaminomethylene)acetamide | CHEMBL237062
TypeSmall organic molecule
Emp. Form.C22H22ClN3O2S
Mol. Mass.427.947
SMILESCCCOc1ccc(cc1)-c1scc(c1CC(=O)NC(N)=N)-c1ccccc1Cl