Reaction Details
TargetKinesin-like protein KIF11
LigandBDBM50209228
Substrate/Competitorn/a
Meas. Tech.ChEMBL_449205 (CHEMBL898408)
IC50 2.2±n/a nM
Citation Coleman, PJSchreier, JDCox, CDFraley, MEGarbaccio, RMBuser, CAWalsh, ESHamilton, KLobell, RBRickert, KTao, WDiehl, RESouth, VJDavide, JPKohl, NEYan, YKuo, LPrueksaritanont, TLi, CMahan, EAFernandez-Metzler, CSalata, JJHartman, GD Kinesin spindle protein (KSP) inhibitors. Part 6: Design and synthesis of 3,5-diaryl-4,5-dihydropyrazole amides as potent inhibitors of the mitotic kinesin KSP. Bioorg Med Chem Lett17:5390-5 (2007) 
 
Kinesin-like protein KIF11
Name:Kinesin-like protein KIF11
Type:PROTEIN
Mol. Mass.:119138.97
Organism:Homo sapiens (Human)
Description:ChEMBL_1457426
Residue:1056
BDBM50209228
NameBDBM50209228
Synonyms:(S)-2-(3-aminopropyl)-4-(2,5-difluorophenyl)-N,N-dimethyl-2-phenyl-2H-pyrrole-1(5H)-carboxamide | CHEMBL395332
TypeSmall organic molecule
Emp. Form.C22H25F2N3O
Mol. Mass.385.4502
SMILESCN(C)C(=O)N1CC(=C[C@@]1(CCCN)c1ccccc1)c1cc(F)ccc1F