Reaction Details
TargetGlutamate receptor ionotropic, NMDA 2B
LigandBDBM50220576
Substrate/Competitorn/a
Meas. Tech.ChEMBL_457335 (CHEMBL940926)
IC50 11±n/a nM
Citation Kawai, MAndo, KMatsumoto, YSakurada, IHirota, MNakamura, HOhta, ASudo, MHattori, KTakashima, THizue, MWatanabe, SFujita, IMizutani, MKawamura, M Discovery of (-)-6-[2-[4-(3-fluorophenyl)-4-hydroxy-1-piperidinyl]-1-hydroxyethyl]-3,4-dihydro-2(1H)-quinolinone--a potent NR2B-selective N-methyl D-aspartate (NMDA) antagonist for the treatment of pain. Bioorg Med Chem Lett17:5558-62 (2007) 
 
Glutamate receptor ionotropic, NMDA 2B
Name:Glutamate receptor ionotropic, NMDA 2B
Type:Protein
Mol. Mass.:166077.66
Organism:Rattus norvegicus (Rat)
Description:Q00960
Residue:1482
BDBM50220576
NameBDBM50220576
Synonyms:6-(2-(4-(4-fluorophenyl)-4-hydroxypiperidin-1-yl)-1-hydroxypropyl)-3,4-dihydroquinolin-2(1H)-one | CHEMBL404851
TypeSmall organic molecule
Emp. Form.C23H27FN2O3
Mol. Mass.398.4705
SMILESCC(C(O)c1ccc2NC(=O)CCc2c1)N1CCC(O)(CC1)c1ccc(F)cc1