Reaction Details
TargetGlutamate receptor ionotropic, NMDA 2B
LigandBDBM50220586
Substrate/Competitorn/a
Meas. Tech.ChEMBL_457335 (CHEMBL940926)
IC50 21.0±n/a nM
Citation Kawai, MAndo, KMatsumoto, YSakurada, IHirota, MNakamura, HOhta, ASudo, MHattori, KTakashima, THizue, MWatanabe, SFujita, IMizutani, MKawamura, M Discovery of (-)-6-[2-[4-(3-fluorophenyl)-4-hydroxy-1-piperidinyl]-1-hydroxyethyl]-3,4-dihydro-2(1H)-quinolinone--a potent NR2B-selective N-methyl D-aspartate (NMDA) antagonist for the treatment of pain. Bioorg Med Chem Lett17:5558-62 (2007) 
 
Glutamate receptor ionotropic, NMDA 2B
Name:Glutamate receptor ionotropic, NMDA 2B
Type:Protein
Mol. Mass.:166077.66
Organism:Rattus norvegicus (Rat)
Description:Q00960
Residue:1482
BDBM50220586
NameBDBM50220586
Synonyms:1-[2-hydroxy-2-(6-hydroxy-biphenyl-3-yl)-1-methyl-ethyl]-4-phenyl-piperidin-4-ol CHEMBL246819
TypeSmall organic molecule
Emp. Form.C22H25FN2O3
Mol. Mass.384.4439
SMILESOC(CN1CCC(O)(CC1)c1cccc(F)c1)c1ccc2NC(=O)CCc2c1