Reaction Details
TargetGrowth hormone secretagogue receptor type 1
LigandBDBM50222136
Substrate/Competitorn/a
Meas. Tech.ChEMBL_449846 (CHEMBL897910)
Ki 470±n/a nM
Citation Hernández, ASCheng, PTMusial, CMSwartz, SGGeorge, RJGrover, GSlusarchyk, DSeethala, RKSmith, MDickinson, KGiupponi, LLonghi, DAFlynn, NMurphy, BJGordon, DABiller, SARobl, JATino, JA Discovery, synthesis, and structure-activity studies of tetrazole based growth hormone secretagogues. Bioorg Med Chem Lett17:5928-33 (2007) 
 
Growth hormone secretagogue receptor type 1
Name:Growth hormone secretagogue receptor type 1
Type:Receptor
Mol. Mass.:41334.57
Organism:Homo sapiens (Human)
Description:Receptor binding studies use plasma membranes from LLC PK-1 cells transiently transfected with hGHSR1a.
Residue:366
BDBM50222136
NameBDBM50222136
Synonyms:CHEMBL235793 | methyl 2-(5-((S)-1-(2-amino-2-methylpropanamido)-2-(benzyloxy)ethyl)-1H-tetrazol-1-yl)-2-phenylacetate
TypeSmall organic molecule
Emp. Form.C23H28N6O4
Mol. Mass.452.5062
SMILESCOC(=O)C(c1ccccc1)n1nnnc1[C@@H](COCc1ccccc1)NC(=O)C(C)(C)N