Reaction Details
TargetGrowth hormone secretagogue receptor type 1
LigandBDBM50222166
Substrate/Competitorn/a
Meas. Tech.ChEMBL_449846 (CHEMBL897910)
Ki 820±n/a nM
Citation Hernández, ASCheng, PTMusial, CMSwartz, SGGeorge, RJGrover, GSlusarchyk, DSeethala, RKSmith, MDickinson, KGiupponi, LLonghi, DAFlynn, NMurphy, BJGordon, DABiller, SARobl, JATino, JA Discovery, synthesis, and structure-activity studies of tetrazole based growth hormone secretagogues. Bioorg Med Chem Lett17:5928-33 (2007) 
 
Growth hormone secretagogue receptor type 1
Name:Growth hormone secretagogue receptor type 1
Type:Receptor
Mol. Mass.:41334.57
Organism:Homo sapiens (Human)
Description:Receptor binding studies use plasma membranes from LLC PK-1 cells transiently transfected with hGHSR1a.
Residue:366
BDBM50222166
NameBDBM50222166
Synonyms:2-amino-N-((S)-2-benzyloxy-1-{1-[2-(3-phenyl-propylcarbamoyl)-ethyl]-1H-tetrazol-5-yl}-ethyl)-2-methyl-propionamide | CHEMBL235011
TypeSmall organic molecule
Emp. Form.C26H35N7O3
Mol. Mass.493.6012
SMILESCC(C)(N)C(=O)N[C@H](COCc1ccccc1)c1nnnn1CCC(=O)NCCCc1ccccc1