Reaction Details
TargetProto-oncogene tyrosine-protein kinase Src
LigandBDBM50224379
Substrate/Competitorn/a
Meas. Tech.ChEMBL_450769 (CHEMBL899855)
Ki 15000±n/a nM
Citation Manetti, FSantucci, ALocatelli, GAMaga, GSpreafico, ASerchi, TOrlandini, MBernardini, GCaradonna, NPSpallarossa, ABrullo, CSchenone, SBruno, ORanise, ABondavalli, FHoffmann, OBologna, MAngelucci, ABotta, M Identification of a novel pyrazolo[3,4-d]pyrimidine able to inhibit cell proliferation of a human osteogenic sarcoma in vitro and in a xenograft model in mice. J Med Chem50:5579-88 (2007) 
 
Proto-oncogene tyrosine-protein kinase Src
Name:Proto-oncogene tyrosine-protein kinase Src
Type:Protein
Mol. Mass.:59838.60
Organism:Homo sapiens (Human)
Description:P12931
Residue:536
BDBM50224379
NameBDBM50224379
Synonyms:1-(2-chloro-2-phenylethyl)-N-(4-methylphenethyl)-6-(methylthio)-1H-pyrazolo[3,4-d]pyrimidin-4-amine [1-(2-chloro-2-phenyl-ethyl)-6-methylsulfanyl-1H-pyrazolo[3,4-d]pyrimidin-4-yl]-(2-p-tolyl-ethyl)-amine
TypeSmall organic molecule
Emp. Form.C23H24ClN5S
Mol. Mass.437.988
SMILESCSc1nc(NCCc2ccc(C)cc2)c2cnn(CC(Cl)c3ccccc3)c2n1