Reaction Details
TargetProto-oncogene tyrosine-protein kinase Src
LigandBDBM50224383
Substrate/Competitorn/a
Meas. Tech.ChEMBL_450769 (CHEMBL899855)
Ki 2800±n/a nM
Citation Manetti, FSantucci, ALocatelli, GAMaga, GSpreafico, ASerchi, TOrlandini, MBernardini, GCaradonna, NPSpallarossa, ABrullo, CSchenone, SBruno, ORanise, ABondavalli, FHoffmann, OBologna, MAngelucci, ABotta, M Identification of a novel pyrazolo[3,4-d]pyrimidine able to inhibit cell proliferation of a human osteogenic sarcoma in vitro and in a xenograft model in mice. J Med Chem50:5579-88 (2007) 
 
Proto-oncogene tyrosine-protein kinase Src
Name:Proto-oncogene tyrosine-protein kinase Src
Type:Protein
Mol. Mass.:59838.60
Organism:Homo sapiens (Human)
Description:P12931
Residue:536
BDBM50224383
NameBDBM50224383
Synonyms:1-(2-chloro-2-(4-chlorophenyl)ethyl)-6-(methylthio)-N-phenethyl-1H-pyrazolo[3,4-d]pyrimidin-4-amine | CHEMBL238304
TypeSmall organic molecule
Emp. Form.C22H21Cl2N5S
Mol. Mass.458.407
SMILESCSc1nc(NCCc2ccccc2)c2cnn(CC(Cl)c3ccc(Cl)cc3)c2n1