Reaction Details
TargetProto-oncogene tyrosine-protein kinase Src
LigandBDBM50224387
Substrate/Competitorn/a
Meas. Tech.ChEMBL_450769 (CHEMBL899855)
Ki 3100±n/a nM
Citation Manetti, FSantucci, ALocatelli, GAMaga, GSpreafico, ASerchi, TOrlandini, MBernardini, GCaradonna, NPSpallarossa, ABrullo, CSchenone, SBruno, ORanise, ABondavalli, FHoffmann, OBologna, MAngelucci, ABotta, M Identification of a novel pyrazolo[3,4-d]pyrimidine able to inhibit cell proliferation of a human osteogenic sarcoma in vitro and in a xenograft model in mice. J Med Chem50:5579-88 (2007) 
 
Proto-oncogene tyrosine-protein kinase Src
Name:Proto-oncogene tyrosine-protein kinase Src
Type:Protein
Mol. Mass.:59838.60
Organism:Homo sapiens (Human)
Description:P12931
Residue:536
BDBM50224387
NameBDBM50224387
Synonyms:1-(2-chloro-2-phenylethyl)-N-(2-chlorobenzyl)-6-(methylthio)-1H-pyrazolo[3,4-d]pyrimidin-4-amine N-(2-chlorobenzyl)-1-(2-chloro-2-phenylethyl)-6-(methylthio)-1H-pyrazolo[3,4-d]pyrimidin-4-amine
TypeSmall organic molecule
Emp. Form.C21H19Cl2N5S
Mol. Mass.444.38
SMILESCSc1nc(NCc2ccccc2Cl)c2cnn(CC(Cl)c3ccccc3)c2n1