Reaction Details
TargetMetabotropic glutamate receptor 1
LigandBDBM50224399
Substrate/Competitorn/a
Meas. Tech.ChEMBL_450774 (CHEMBL899859)
IC50 446±n/a nM
Citation Wu, WLBurnett, DADomalski, MGreenlee, WJLi, CBertorelli, RFredduzzi, SLozza, GVeltri, AReggiani, A Discovery of orally efficacious tetracyclic metabotropic glutamate receptor 1 (mGluR1) antagonists for the treatment of chronic pain. J Med Chem50:5550-3 (2007) 
 
Metabotropic glutamate receptor 1
Name:Metabotropic glutamate receptor 1
Type:Enzyme
Mol. Mass.:132358.19
Organism:Homo sapiens (Human)
Description:Q13255
Residue:1194
BDBM50224399
NameBDBM50224399
Synonyms:8-(4-methylphenyl)thiazolo[4'',5'':4',5']pyrido[3',2':4,5]thieno[3,2-d]pyrimidine-2,7(1H,8H)-dione | CHEMBL392164
TypeSmall organic molecule
Emp. Form.C17H10N4O2S2
Mol. Mass.366.417
SMILESCc1ccc(cc1)-n1cnc2c(sc3[nH]cc4sc(=O)nc4c23)c1=O