Reaction Details
TargetMetabotropic glutamate receptor 1
LigandBDBM50224390
Substrate/Competitorn/a
Meas. Tech.ChEMBL_450774 (CHEMBL899859)
IC50 0.700000±n/a nM
Citation Wu, WLBurnett, DADomalski, MGreenlee, WJLi, CBertorelli, RFredduzzi, SLozza, GVeltri, AReggiani, A Discovery of orally efficacious tetracyclic metabotropic glutamate receptor 1 (mGluR1) antagonists for the treatment of chronic pain. J Med Chem50:5550-3 (2007) 
 
Metabotropic glutamate receptor 1
Name:Metabotropic glutamate receptor 1
Type:Enzyme
Mol. Mass.:132358.19
Organism:Homo sapiens (Human)
Description:Q13255
Residue:1194
BDBM50224390
NameBDBM50224390
Synonyms:8-(4-methylphenyl)-1h-pyrrolo[2'',3'':4',5']pyrido[3',2':4,5]thieno[3,2-d]pyrimidin-7(8H)-one | CHEMBL393705
TypeSmall organic molecule
Emp. Form.C18H12N4OS
Mol. Mass.332.379
SMILESCc1ccc(cc1)-n1cnc2c(sc3ncc4cc[nH]c4c23)c1=O