Reaction Details
TargetMetabotropic glutamate receptor 1
LigandBDBM50224391
Substrate/Competitorn/a
Meas. Tech.ChEMBL_450774 (CHEMBL899859)
IC50 2.9±n/a nM
Citation Wu, WLBurnett, DADomalski, MGreenlee, WJLi, CBertorelli, RFredduzzi, SLozza, GVeltri, AReggiani, A Discovery of orally efficacious tetracyclic metabotropic glutamate receptor 1 (mGluR1) antagonists for the treatment of chronic pain. J Med Chem50:5550-3 (2007) 
 
Metabotropic glutamate receptor 1
Name:Metabotropic glutamate receptor 1
Type:Enzyme
Mol. Mass.:132358.19
Organism:Homo sapiens (Human)
Description:Q13255
Residue:1194
BDBM50224391
NameBDBM50224391
Synonyms:9-(4-chlorophenyl)-2,3-dihydro-1H-pyrimido[4'',5'':4',5']thieno[3',2':5,6]pyrido[3,4-b][1,4]oxazin-8(9H)-one | CHEMBL236994
TypeSmall organic molecule
Emp. Form.C17H11ClN4O2S
Mol. Mass.370.813
SMILESClc1ccc(cc1)-n1cnc2c(sc3ncc4OCCNc4c23)c1=O