Reaction Details
TargetMetabotropic glutamate receptor 1
LigandBDBM50224393
Substrate/Competitorn/a
Meas. Tech.ChEMBL_450777 (CHEMBL899862)
Ki 11±n/a nM
Citation Wu, WLBurnett, DADomalski, MGreenlee, WJLi, CBertorelli, RFredduzzi, SLozza, GVeltri, AReggiani, A Discovery of orally efficacious tetracyclic metabotropic glutamate receptor 1 (mGluR1) antagonists for the treatment of chronic pain. J Med Chem50:5550-3 (2007) 
 
Metabotropic glutamate receptor 1
Name:Metabotropic glutamate receptor 1
Type:Enzyme Catalytic Domain
Mol. Mass.:133240.47
Organism:RAT
Description:metabotropic glutamate 1/2 0 RAT::P23385
Residue:1199
BDBM50224393
NameBDBM50224393
Synonyms:8-(4-chlorophenyl)-1h-imidazo[4'',5'':4',5']pyrido[3',2':4,5]thieno[3,2-d]pyrimidin-7(8H)-one | CHEMBL394914
TypeSmall organic molecule
Emp. Form.C16H8ClN5OS
Mol. Mass.353.786
SMILESClc1ccc(cc1)-n1cnc2c(sc3ncc4[nH]cnc4c23)c1=O