Reaction Details
TargetMetabotropic glutamate receptor 5
LigandBDBM50224397
Substrate/Competitorn/a
Meas. Tech.ChEMBL_450775 (CHEMBL899860)
IC50 10000±n/a nM
Citation Wu, WLBurnett, DADomalski, MGreenlee, WJLi, CBertorelli, RFredduzzi, SLozza, GVeltri, AReggiani, A Discovery of orally efficacious tetracyclic metabotropic glutamate receptor 1 (mGluR1) antagonists for the treatment of chronic pain. J Med Chem50:5550-3 (2007) 
 
Metabotropic glutamate receptor 5
Name:Metabotropic glutamate receptor 5
Type:Enzyme
Mol. Mass.:132484.72
Organism:Homo sapiens (Human)
Description:n/a
Residue:1212
BDBM50224397
NameBDBM50224397
Synonyms:9-dimethylamino-3-(4-methoxy-phenyl)-3H-pyrido[3',2':4,5]thieno[3,2-d]pyrimidin-4-one cid_1208332
TypeSmall organic molecule
Emp. Form.C18H16N4O2S
Mol. Mass.352.41
SMILESCOc1ccc(cc1)-n1cnc2c(sc3nccc(N(C)C)c23)c1=O