Reaction Details
TargetMetabotropic glutamate receptor 5
LigandBDBM50224396
Substrate/Competitorn/a
Meas. Tech.ChEMBL_450775 (CHEMBL899860)
IC50>1000±n/a nM
Citation Wu, WLBurnett, DADomalski, MGreenlee, WJLi, CBertorelli, RFredduzzi, SLozza, GVeltri, AReggiani, A Discovery of orally efficacious tetracyclic metabotropic glutamate receptor 1 (mGluR1) antagonists for the treatment of chronic pain. J Med Chem50:5550-3 (2007) 
 
Metabotropic glutamate receptor 5
Name:Metabotropic glutamate receptor 5
Type:Enzyme
Mol. Mass.:132484.72
Organism:Homo sapiens (Human)
Description:n/a
Residue:1212
BDBM50224396
NameBDBM50224396
Synonyms:9-(4-chlorophenyl)-2,3-dihydro-3(S)-methyl-1H-pyrimido[4'',5'':4',5']thieno[3',2':5,6]pyrido[3,4-b][1,4]oxazin-8(9H)-one | CHEMBL236180
TypeSmall organic molecule
Emp. Form.C18H13ClN4O2S
Mol. Mass.384.839
SMILESC[C@H]1CNc2c(O1)cnc1sc3c(ncn(-c4ccc(Cl)cc4)c3=O)c21