Reaction Details
TargetSerine/threonine-protein kinase Chk2
LigandBDBM50163251
Substrate/Competitorn/a
Meas. Tech.ChEMBL_458529 (CHEMBL942788)
IC50 2±n/a nM
Citation Neff, DKLee-Dutra, ABlevitt, JMAxe, FUHack, MDBuma, JCRynberg, RBrunmark, AKarlsson, LBreitenbucher, JG 2-Aryl benzimidazoles featuring alkyl-linked pendant alcohols and amines as inhibitors of checkpoint kinase Chk2. Bioorg Med Chem Lett17:6467-71 (2007) 
 
Serine/threonine-protein kinase Chk2
Name:Serine/threonine-protein kinase Chk2
Type:Protein
Mol. Mass.:60908.59
Organism:Homo sapiens (Human)
Description:O96017
Residue:543
BDBM50163251
NameBDBM50163251
Synonyms:2-(4-(4-hydroxyphenylthio)phenyl)-1H-benzo[d]imidazole-5-carboxamide CHEMBL195041
TypeSmall organic molecule
Emp. Form.C20H15N3O2S
Mol. Mass.361.417
SMILESNC(=O)c1ccc2nc([nH]c2c1)-c1ccc(Sc2ccc(O)cc2)cc1