Reaction Details
TargetVasopressin V2 receptor
LigandBDBM50225162
Substrate/Competitorn/a
Meas. Tech.ChEMBL_458592 (CHEMBL942875)
IC50 8±n/a nM
Citation Xiang, MARybczynski, PJPatel, MChen, RHMcComsey, DFZhang, HCGunnet, JWLook, RWang, YMinor, LKZhong, HMVillani, FJDemarest, KTDamiano, BPMaryanoff, BE Next-generation spirobenzazepines: identification of RWJ-676070 as a balanced vasopressin V1a/V2 receptor antagonist for human clinical studies. Bioorg Med Chem Lett17:6623-8 (2007) 
 
Vasopressin V2 receptor
Name:Vasopressin V2 receptor
Type:Receptor
Mol. Mass.:40295.28
Organism:Homo sapiens (Human)
Description:P30518
Residue:371
BDBM50225162
NameBDBM50225162
Synonyms:(4R)-N-[2-(dimethylamino)ethyl]-1-({4-[(2-phenylbenzene)amido]phenyl}carbonyl)-1,2,3,5-tetrahydrospiro[1-benzazepine-4,1'-cyclopentan]-2'-ene-3'-carboxamide | CHEMBL399888
TypeSmall organic molecule
Emp. Form.C39H40N4O3
Mol. Mass.612.7599
SMILESCN(C)CCNC(=O)C1=C[C@@]2(CC1)CCN(C(=O)c1ccc(NC(=O)c3ccccc3-c3ccccc3)cc1)c1ccccc1C2