Reaction Details
TargetBeta-lactamase TEM
LigandBDBM50225375
Substrate/Competitorn/a
Meas. Tech.ChEMBL_451362 (CHEMBL901565)
Ki 260±n/a nM
Citation Venturelli, ATondi, DCancian, LMorandi, FCannazza, GSegatore, BPrati, FAmicosante, GShoichet, BKCosti, MP Optimizing cell permeation of an antibiotic resistance inhibitor for improved efficacy. J Med Chem50:5644-54 (2007) 
 
Beta-lactamase TEM
Name:Beta-lactamase TEM
Type:Enzyme
Mol. Mass.:31512.33
Organism:Escherichia coli
Description:P62593
Residue:286
BDBM50225375
NameBDBM50225375
Synonyms:CHEMBL396390 | pinacol 5-aminomethylbenzo[b]thiophen-2-ylboronate
TypeSmall organic molecule
Emp. Form.C8H8BNO2S
Mol. Mass.193.031
SMILESNc1ccc2sc(cc2c1)B(O)O