Reaction Details
TargetBeta-lactamase TEM
LigandBDBM50225384
Substrate/Competitorn/a
Meas. Tech.ChEMBL_451362 (CHEMBL901565)
Ki 450±n/a nM
Citation Venturelli, ATondi, DCancian, LMorandi, FCannazza, GSegatore, BPrati, FAmicosante, GShoichet, BKCosti, MP Optimizing cell permeation of an antibiotic resistance inhibitor for improved efficacy. J Med Chem50:5644-54 (2007) 
 
Beta-lactamase TEM
Name:Beta-lactamase TEM
Type:Enzyme
Mol. Mass.:31512.33
Organism:Escherichia coli
Description:P62593
Residue:286
BDBM50225384
NameBDBM50225384
Synonyms:5-formylaminomethylbenzo[b]thiophen-2-ylboronic acid | CHEMBL235291
TypeSmall organic molecule
Emp. Form.C10H10BNO3S
Mol. Mass.235.067
SMILESOB(O)c1cc2cc(CNC=O)ccc2s1