Reaction Details
TargetBeta-lactamase TEM
LigandBDBM50225393
Substrate/Competitorn/a
Meas. Tech.ChEMBL_451362 (CHEMBL901565)
Ki 28±n/a nM
Citation Venturelli, ATondi, DCancian, LMorandi, FCannazza, GSegatore, BPrati, FAmicosante, GShoichet, BKCosti, MP Optimizing cell permeation of an antibiotic resistance inhibitor for improved efficacy. J Med Chem50:5644-54 (2007) 
 
Beta-lactamase TEM
Name:Beta-lactamase TEM
Type:Enzyme
Mol. Mass.:31512.33
Organism:Escherichia coli
Description:P62593
Residue:286
BDBM50225393
NameBDBM50225393
Synonyms:CHEMBL235526 | pinacol 5-[(carboxymethylamino)methyl]benzo[b]thiophen-2-ylboronate
TypeSmall organic molecule
Emp. Form.C11H12BNO4S
Mol. Mass.265.093
SMILESOB(O)c1cc2cc(CNCC(O)=O)ccc2s1