Reaction Details
TargetP2X purinoceptor 7
LigandBDBM50225551
Substrate/Competitorn/a
Meas. Tech.ChEMBL_451545 (CHEMBL900721)
IC50 32±n/a nM
Citation Furber, MAlcaraz, LBent, JEBeyerbach, ABowers, KBraddock, MCaffrey, MVCladingboel, DCollington, JDonald, DKFagura, MInce, FKinchin, ECLaurent, CLawson, MLuker, TJMortimore, MMPimm, ADRiley, RJRoberts, NRobertson, MTheaker, JThorne, PVWeaver, RWebborn, PWillis, P Discovery of potent and selective adamantane-based small-molecule P2X(7) receptor antagonists/interleukin-1beta inhibitors. J Med Chem50:5882-5 (2007) 
 
P2X purinoceptor 7
Name:P2X purinoceptor 7
Type:Protein
Mol. Mass.:68403.50
Organism:Rattus norvegicus (Rat)
Description:Q64663
Residue:595
BDBM50225551
NameBDBM50225551
Synonyms:CHEMBL392378 | N-adamantan-1-ylmethyl-2-chloro-5-(piperidin-3-ylamino)-benzamide
TypeSmall organic molecule
Emp. Form.C23H32ClN3O
Mol. Mass.401.973
SMILESClc1ccc(NC2CCCNC2)cc1C(=O)NCC12CC3CC(CC(C3)C1)C2