Reaction Details
TargetP2X purinoceptor 7
LigandBDBM50411435
Substrate/Competitorn/a
Meas. Tech.ChEMBL_451545 (CHEMBL900721)
IC50 316±n/a nM
Citation Furber, MAlcaraz, LBent, JEBeyerbach, ABowers, KBraddock, MCaffrey, MVCladingboel, DCollington, JDonald, DKFagura, MInce, FKinchin, ECLaurent, CLawson, MLuker, TJMortimore, MMPimm, ADRiley, RJRoberts, NRobertson, MTheaker, JThorne, PVWeaver, RWebborn, PWillis, P Discovery of potent and selective adamantane-based small-molecule P2X(7) receptor antagonists/interleukin-1beta inhibitors. J Med Chem50:5882-5 (2007) 
 
P2X purinoceptor 7
Name:P2X purinoceptor 7
Type:Protein
Mol. Mass.:68403.50
Organism:Rattus norvegicus (Rat)
Description:Q64663
Residue:595
BDBM50411435
NameBDBM50411435
Synonyms:CHEMBL236860
TypeSmall organic molecule
Emp. Form.C21H29ClN4O2
Mol. Mass.404.934
SMILESClc1cnc(OC2CCCNC2)nc1C(=O)NCC12CC3CC(CC(C3)C1)C2