Reaction Details
TargetFarnesyl pyrophosphate synthase
LigandBDBM50225563
Substrate/Competitorn/a
Meas. Tech.ChEMBL_451566 (CHEMBL901776)
IC50 27400±n/a nM
Citation Zhang, YHudock, MPKrysiak, KCao, RBergan, KYin, FLeon, AOldfield, E Activity of sulfonium bisphosphonates on tumor cell lines. J Med Chem50:6067-79 (2007) 
 
Farnesyl pyrophosphate synthase
Name:Farnesyl pyrophosphate synthase
Type:Enzyme
Mol. Mass.:48272.89
Organism:Homo sapiens (Human)
Description:P14324
Residue:419
BDBM50225563
NameBDBM50225563
Synonyms:2-(methyl, licosylsulfonium-1-yl)ethylidene-1,1-bisphosphonic acid | CHEMBL237379
TypeSmall organic molecule
Emp. Form.C23H50O6P2S
Mol. Mass.516.652
[S+](C)CC(P(O)(O)=O)P(O)([O-])=O