Reaction Details
TargetFarnesyl pyrophosphate synthase
LigandBDBM25275
Substrate/Competitorn/a
Meas. Tech.ChEMBL_451566 (CHEMBL901776)
IC50 7943±n/a nM
Citation Zhang, YHudock, MPKrysiak, KCao, RBergan, KYin, FLeon, AOldfield, E Activity of sulfonium bisphosphonates on tumor cell lines. J Med Chem50:6067-79 (2007) 
 
Farnesyl pyrophosphate synthase
Name:Farnesyl pyrophosphate synthase
Type:Enzyme
Mol. Mass.:48272.89
Organism:Homo sapiens (Human)
Description:P14324
Residue:419
BDBM25275
NameBDBM25275
Synonyms:CHEMBL237808 hydrogen {2-[methyl(tetradecyl)sulfanylium]-1-phosphonoethyl}phosphonate
TypeSmall organic molecule
Emp. Form.C17H38O6P2S
Mol. Mass.432.493
[S+](C)CC(P(O)(O)=O)P(O)([O-])=O