Reaction Details
TargetFarnesyl pyrophosphate synthase
LigandBDBM50226000
Substrate/Competitorn/a
Meas. Tech.ChEMBL_451825 (CHEMBL902037)
IC50>600000±n/a nM
Citation Marma, MSXia, ZStewart, CCoxon, FDunford, JEBaron, RKashemirov, BAEbetino, FHTriffitt, JTRussell, RGMcKenna, CE Synthesis and biological evaluation of alpha-halogenated bisphosphonate and phosphonocarboxylate analogues of risedronate. J Med Chem50:5967-75 (2007) 
 
Farnesyl pyrophosphate synthase
Name:Farnesyl pyrophosphate synthase
Type:Enzyme
Mol. Mass.:48272.89
Organism:Homo sapiens (Human)
Description:P14324
Residue:419
BDBM50226000
NameBDBM50226000
Synonyms:2-fluoro-3-(3-pyridinyl)-2-phosphonopropionic acid | CHEMBL240771
TypeSmall organic molecule
Emp. Form.C8H9FNO5P
Mol. Mass.249.1329
SMILESOC(=O)C(F)(Cc1cccnc1)P(O)(O)=O