Reaction Details
TargetFarnesyl pyrophosphate synthase
LigandBDBM50225998
Substrate/Competitorn/a
Meas. Tech.ChEMBL_451825 (CHEMBL902037)
IC50>600000±n/a nM
Citation Marma, MSXia, ZStewart, CCoxon, FDunford, JEBaron, RKashemirov, BAEbetino, FHTriffitt, JTRussell, RGMcKenna, CE Synthesis and biological evaluation of alpha-halogenated bisphosphonate and phosphonocarboxylate analogues of risedronate. J Med Chem50:5967-75 (2007) 
 
Farnesyl pyrophosphate synthase
Name:Farnesyl pyrophosphate synthase
Type:Enzyme
Mol. Mass.:48272.89
Organism:Homo sapiens (Human)
Description:P14324
Residue:419
BDBM50225998
NameBDBM50225998
Synonyms:2-chloro-3-(3-pyridinyl)-2-phosphonopropionic acid | CHEMBL240772
TypeSmall organic molecule
Emp. Form.C8H9ClNO5P
Mol. Mass.265.588
SMILESOC(=O)C(Cl)(Cc1cccnc1)P(O)(O)=O