Reaction Details
TargetD(2) dopamine receptor
LigandBDBM50226003
Substrate/Competitorn/a
Meas. Tech.ChEMBL_458712 (CHEMBL942047)
EC50>10000±n/a nM
Citation Blagg, JAllerton, CMBatchelor, DVBaxter, ADBurring, DJCarr, CLCook, ASNichols, CLPhipps, JSanderson, VGVerrier, HWong, S Design and synthesis of a functionally selective D3 agonist and its in vivo delivery via the intranasal route. Bioorg Med Chem Lett17:6691-6 (2007) 
 
D(2) dopamine receptor
Name:D(2) dopamine receptor
Type:Cell-surface receptors
Mol. Mass.:50647.10
Organism:Homo sapiens (Human)
Description:P14416
Residue:443
BDBM50226003
NameBDBM50226003
Synonyms:(S)-2-fluoro-5-(4-propylmorpholin-2-yl)phenol | CHEMBL401125
TypeSmall organic molecule
Emp. Form.C13H18FNO2
Mol. Mass.239.2859
SMILESCCCN1CCO[C@H](C1)c1ccc(F)c(O)c1