Reaction Details
TargetD(3) dopamine receptor
LigandBDBM50226012
Substrate/Competitorn/a
Meas. Tech.ChEMBL_458713 (CHEMBL942048)
EC50 32±n/a nM
Citation Blagg, JAllerton, CMBatchelor, DVBaxter, ADBurring, DJCarr, CLCook, ASNichols, CLPhipps, JSanderson, VGVerrier, HWong, S Design and synthesis of a functionally selective D3 agonist and its in vivo delivery via the intranasal route. Bioorg Med Chem Lett17:6691-6 (2007) 
 
D(3) dopamine receptor
Name:D(3) dopamine receptor
Type:n/a
Mol. Mass.:44243.43
Organism:Homo sapiens (Human)
Description:n/a
Residue:400
BDBM50226012
NameBDBM50226012
Synonyms:(R)-5-(4-propylmorpholin-2-yl)benzene-1,3-diol | CHEMBL250003
TypeSmall organic molecule
Emp. Form.C13H19NO3
Mol. Mass.237.2949
SMILESCCCN1CCO[C@@H](C1)c1cc(O)cc(O)c1