Reaction Details
Target5-hydroxytryptamine receptor 2A
LigandBDBM50226008
Substrate/Competitorn/a
Meas. Tech.ChEMBL_458728 (CHEMBL943013)
Ki 970±n/a nM
Citation Blagg, JAllerton, CMBatchelor, DVBaxter, ADBurring, DJCarr, CLCook, ASNichols, CLPhipps, JSanderson, VGVerrier, HWong, S Design and synthesis of a functionally selective D3 agonist and its in vivo delivery via the intranasal route. Bioorg Med Chem Lett17:6691-6 (2007) 
 
5-hydroxytryptamine receptor 2A
Name:5-hydroxytryptamine receptor 2A
Type:G Protein-Coupled Receptor (GPCR)
Mol. Mass.:52852.05
Organism:Rattus norvegicus (rat)
Description:Rat cortex membranes 5-HT2A receptors.
Residue:471
BDBM50226008
NameBDBM50226008
Synonyms:(R)-3-(4-propylmorpholin-2-yl)phenol | CHEMBL250403
TypeSmall organic molecule
Emp. Form.C13H19NO2
Mol. Mass.221.2955
SMILESCCCN1CCO[C@@H](C1)c1cccc(O)c1