Reaction Details
TargetHydroxycarboxylic acid receptor 2
LigandBDBM23515
Substrate/Competitorn/a
Meas. Tech.ChEMBL_460002 (CHEMBL944045)
EC50 1000±n/a nM
Citation Shen, HCSzymonifka, MJKharbanda, DDeng, QCarballo-Jane, EWu, KKWu, TJCheng, KRen, NCai, TQTaggart, AKWang, JTong, XWaters, MGHammond, MLTata, JRColletti, SL Discovery of orally bioavailable and novel urea agonists of the high affinity niacin receptor GPR109A. Bioorg Med Chem Lett17:6723-8 (2008) 
 
Hydroxycarboxylic acid receptor 2
Name:Hydroxycarboxylic acid receptor 2
Type:G Protein-Coupled Receptor (GPCR)
Mol. Mass.:41868.22
Organism:Homo sapiens (Human)
Description:Membranes from CHO cells expressing the recombinant human GPR109A were used in competition binding assay.
Residue:363
BDBM23515
NameBDBM23515
Synonyms:CHEMBL573 Nicotinic Acid pyridine-3-carboxylic acid | wampocap
TypeSmall organic molecule
Emp. Form.C6H5NO2
Mol. Mass.123.1094
SMILESOC(=O)c1cccnc1