Reaction Details
TargetTyrosine-protein phosphatase non-receptor type 2
LigandBDBM50228013
Substrate/Competitorn/a
Meas. Tech.ChEMBL_461677 (CHEMBL927698)
IC50 25±n/a nM
Citation Douty, BWayland, BAla, PJBower, MJPruitt, JBostrom, LWei, MKlabe, RGonneville, LWynn, RBurn, TCLiu, PCCombs, APYue, EW Isothiazolidinone inhibitors of PTP1B containing imidazoles and imidazolines. Bioorg Med Chem Lett18:66-71 (2008) 
 
Tyrosine-protein phosphatase non-receptor type 2
Name:Tyrosine-protein phosphatase non-receptor type 2
Type:Protein
Mol. Mass.:48481.80
Organism:Homo sapiens (Human)
Description:P17706
Residue:415
BDBM50228013
NameBDBM50228013
Synonyms:3-fluoro-N-{1-{(R)-5-[2-(3-methanesulfonyl-phenoxy)-ethyl]-4,5-dihydro-1H-imidazol-2-yl}-2-[3-methyl-4-(1,1,3-trioxo-1lambda6-isothiazolidin-5-yl)-phenyl]-ethyl}-benzenesulfonamide | CHEMBL253476
TypeSmall organic molecule
Emp. Form.C30H33FN4O8S3
Mol. Mass.692.798
SMILESCc1cc(CC(NS(=O)(=O)c2cccc(F)c2)C2=NC[C@@H](CCOc3cccc(c3)S(C)(=O)=O)N2)ccc1C1CC(=O)NS1(=O)=O