Reaction Details
TargetMineralocorticoid receptor
LigandBDBM50228081
Substrate/Competitorn/a
Meas. Tech.ChEMBL_452392 (CHEMBL902628)
Ki 7.5±n/a nM
Citation Bell, MGGernert, DLGrese, TABelvo, MDBorromeo, PSKelley, SAKennedy, JHKolis, SPLander, PARichey, RSharp, VSStephenson, GAWilliams, JDYu, HZimmerman, KMSteinberg, MIJadhav, PK (S)-N-{3-[1-cyclopropyl-1-(2,4-difluoro-phenyl)-ethyl]-1H-indol-7-yl}-methanesulfonamide: a potent, nonsteroidal, functional antagonist of the mineralocorticoid receptor. J Med Chem50:6443-5 (2007) 
 
Mineralocorticoid receptor
Name:Mineralocorticoid receptor
Type:Enzyme
Mol. Mass.:107076.42
Organism:Homo sapiens (Human)
Description:P08235
Residue:984
BDBM50228081
NameBDBM50228081
Synonyms:(S)-N-(3-(1-cyclopropyl-1-(4-fluorophenyl)ethyl)-1H-indol-7-yl)methanesulfonamide | CHEMBL391439
TypeSmall organic molecule
Emp. Form.C20H21FN2O2S
Mol. Mass.372.456
SMILESC[C@@](C1CC1)(c1c[nH]c2c(NS(C)(=O)=O)cccc12)c1ccc(F)cc1