Reaction Details
TargetCoagulation factor X
LigandBDBM50228935
Substrate/Competitorn/a
Meas. Tech.ChEMBL_461718 (CHEMBL928849)
Ki 1.8±n/a nM
Citation Young, RJBorthwick, ADBrown, DBurns-Kurtis, CLCampbell, MChan, CCharbaut, MChung, CWConvery, MAKelly, HAPaul King, NKleanthous, SMason, AMPateman, AJPatikis, ANPinto, ILPollard, DRSenger, SShah, GPToomey, JRWatson, NSWeston, HE Structure and property based design of factor Xa inhibitors: pyrrolidin-2-ones with biaryl P4 motifs. Bioorg Med Chem Lett18:23-7 (2008) 
 
Coagulation factor X
Name:Coagulation factor X
Type:Enzyme
Mol. Mass.:54726.60
Organism:Homo sapiens (Human)
Description:n/a
Residue:488
BDBM50228935
NameBDBM50228935
Synonyms:(E)-2-(5-chloro-thiophen-2-yl)-ethenesulfonic acid {1-[5-(2-cyano-phenyl)-pyridin-2-yl]-2-oxo-pyrrolidin-3-yl}-amide | CHEMBL402383
TypeSmall organic molecule
Emp. Form.C22H17ClN4O3S2
Mol. Mass.484.978
SMILESClc1ccc(\C=C\S(=O)(=O)NC2CCN(C2=O)c2ccc(cn2)-c2ccccc2C#N)s1