Reaction Details
TargetCoagulation factor X
LigandBDBM50228938
Substrate/Competitorn/a
Meas. Tech.ChEMBL_461718 (CHEMBL928849)
Ki 15.5±n/a nM
Citation Young, RJBorthwick, ADBrown, DBurns-Kurtis, CLCampbell, MChan, CCharbaut, MChung, CWConvery, MAKelly, HAPaul King, NKleanthous, SMason, AMPateman, AJPatikis, ANPinto, ILPollard, DRSenger, SShah, GPToomey, JRWatson, NSWeston, HE Structure and property based design of factor Xa inhibitors: pyrrolidin-2-ones with biaryl P4 motifs. Bioorg Med Chem Lett18:23-7 (2008) 
 
Coagulation factor X
Name:Coagulation factor X
Type:Enzyme
Mol. Mass.:54726.60
Organism:Homo sapiens (Human)
Description:n/a
Residue:488
BDBM50228938
NameBDBM50228938
Synonyms:6-chloro-N-(1-(2-fluoro-4-(1-methyl-1H-imidazol-4-yl)phenyl)-2-oxopyrrolidin-3-yl)naphthalene-2-sulfonamide | CHEMBL404707
TypeSmall organic molecule
Emp. Form.C24H20ClFN4O3S
Mol. Mass.498.957
SMILESCn1cnc(c1)-c1ccc(N2CCC(NS(=O)(=O)c3ccc4cc(Cl)ccc4c3)C2=O)c(F)c1