Reaction Details
TargetCoagulation factor X
LigandBDBM50228943
Substrate/Competitorn/a
Meas. Tech.ChEMBL_461718 (CHEMBL928849)
Ki 215±n/a nM
Citation Young, RJBorthwick, ADBrown, DBurns-Kurtis, CLCampbell, MChan, CCharbaut, MChung, CWConvery, MAKelly, HAPaul King, NKleanthous, SMason, AMPateman, AJPatikis, ANPinto, ILPollard, DRSenger, SShah, GPToomey, JRWatson, NSWeston, HE Structure and property based design of factor Xa inhibitors: pyrrolidin-2-ones with biaryl P4 motifs. Bioorg Med Chem Lett18:23-7 (2008) 
 
Coagulation factor X
Name:Coagulation factor X
Type:Enzyme
Mol. Mass.:54726.60
Organism:Homo sapiens (Human)
Description:n/a
Residue:488
BDBM50228943
NameBDBM50228943
Synonyms:6-chloro-naphthalene-2-sulfonic acid [1-(3-fluoro-biphenyl-4-yl)-2-oxo-pyrrolidin-3-yl]-amide | CHEMBL404708
TypeSmall organic molecule
Emp. Form.C26H20ClFN2O3S
Mol. Mass.494.965
SMILESFc1cc(ccc1N1CCC(NS(=O)(=O)c2ccc3cc(Cl)ccc3c2)C1=O)-c1ccccc1