Reaction Details
TargetCoagulation factor X
LigandBDBM50228950
Substrate/Competitorn/a
Meas. Tech.ChEMBL_461718 (CHEMBL928849)
Ki 0.2±n/a nM
Citation Young, RJBorthwick, ADBrown, DBurns-Kurtis, CLCampbell, MChan, CCharbaut, MChung, CWConvery, MAKelly, HAPaul King, NKleanthous, SMason, AMPateman, AJPatikis, ANPinto, ILPollard, DRSenger, SShah, GPToomey, JRWatson, NSWeston, HE Structure and property based design of factor Xa inhibitors: pyrrolidin-2-ones with biaryl P4 motifs. Bioorg Med Chem Lett18:23-7 (2008) 
 
Coagulation factor X
Name:Coagulation factor X
Type:Enzyme
Mol. Mass.:54726.60
Organism:Homo sapiens (Human)
Description:n/a
Residue:488
BDBM50228950
NameBDBM50228950
Synonyms:(E)-2-(5-chloro-thiophen-2-yl)-ethenesulfonic acid [1-(3-fluoro-2'-methanesulfonyl-biphenyl-4-yl)-2-oxo-pyrrolidin-3-yl]-amide | CHEMBL253942
TypeSmall organic molecule
Emp. Form.C23H20ClFN2O5S3
Mol. Mass.555.062
SMILESCS(=O)(=O)c1ccccc1-c1ccc(N2CCC(NS(=O)(=O)\C=C\c3ccc(Cl)s3)C2=O)c(F)c1